{"text_format":"1","workbook":"xlsx","n_sheets":3,"sheets":["Historico_ValorUI","Parametros","Simulador"],"not_rendered":{"charts":0,"images":1,"macros":1,"external_links":0,"defined_names":3,"comments":0,"pivot_tables":0},"unopened":[],"bounds":{"document_bytes":16777216,"sheet_cells":100000,"rows_first":2000,"rows_last":500,"rows_between":2000,"halvings":0,"cell_chars":16384,"cell_head_chars":4096},"cells_cut":0,"cells_raw":0,"read":"whole","date_system":"1900"}

{"sheet":"Historico_ValorUI","index":0,"n_rows":6766,"n_cols":3,"rows_kept":6766,"cut":false,"hidden":true,"merged":[]}
[null,"Unidad Indexada"]
[null,"Período Junio 2002 - 5 de Noviembre de 2020"]
[null,"Fecha","Valor UI"]
[null,"2002-06-01",1]
[null,"2002-06-02",1.0004]
[null,"2002-06-03",1.0007999999999999]
[null,"2002-06-04",1.0012000000000001]
[null,"2002-06-05",1.0016]
[null,"2002-06-06",1.002]
[null,"2002-06-07",1.0024]
[null,"2002-06-08",1.0028999999999999]
[null,"2002-06-09",1.0033000000000001]
[null,"2002-06-10",1.0037]
[null,"2002-06-11",1.0041]
[null,"2002-06-12",1.0044999999999999]
[null,"2002-06-13",1.0048999999999999]
[null,"2002-06-14",1.0053000000000001]
[null,"2002-06-15",1.0057]
[null,"2002-06-16",1.0061]
[null,"2002-06-17",1.0065]
[null,"2002-06-18",1.0068999999999999]
[null,"2002-06-19",1.0074000000000001]
[null,"2002-06-20",1.0078]
[null,"2002-06-21",1.0082]
[null,"2002-06-22",1.0085999999999999]
[null,"2002-06-23",1.0089999999999999]
[null,"2002-06-24",1.0094000000000001]
[null,"2002-06-25",1.0098]
[null,"2002-06-26",1.0102]
[null,"2002-06-27",1.0105999999999999]
[null,"2002-06-28",1.0111000000000001]
[null,"2002-06-29",1.0115000000000001]
[null,"2002-06-30",1.0119]
[null,"2002-07-01",1.0125]
[null,"2002-07-02",1.0129999999999999]
[null,"2002-07-03",1.0136000000000001]
[null,"2002-07-04",1.0142]
[null,"2002-07-05",1.0147999999999999]
[null,"2002-07-06",1.0153000000000001]
[null,"2002-07-07",1.0159]
[null,"2002-07-08",1.0165]
[null,"2002-07-09",1.0170999999999999]
[null,"2002-07-10",1.0176000000000001]
[null,"2002-07-11",1.0182]
[null,"2002-07-12",1.0187999999999999]
[null,"2002-07-13",1.0194000000000001]
[null,"2002-07-14",1.02]
[null,"2002-07-15",1.0205]
[null,"2002-07-16",1.0210999999999999]
[null,"2002-07-17",1.0217000000000001]
[null,"2002-07-18",1.0223]
[null,"2002-07-19",1.0227999999999999]
[null,"2002-07-20",1.0234000000000001]
[null,"2002-07-21",1.024]
[null,"2002-07-22",1.0246]
[null,"2002-07-23",1.0251999999999999]
[null,"2002-07-24",1.0257000000000001]
[null,"2002-07-25",1.0263]
[null,"2002-07-26",1.0268999999999999]
[null,"2002-07-27",1.0275000000000001]
[null,"2002-07-28",1.0281]
[null,"2002-07-29",1.0286999999999999]
[null,"2002-07-30",1.0291999999999999]
[null,"2002-07-31",1.0298]
[null,"2002-08-01",1.0314000000000001]
[null,"2002-08-02",1.0329999999999999]
[null,"2002-08-03",1.0345]
[null,"2002-08-04",1.0361]
[null,"2002-08-05",1.0377000000000001]
[null,"2002-08-06",1.0392999999999999]
[null,"2002-08-07",1.0408999999999999]
[null,"2002-08-08",1.0425]
[null,"2002-08-09",1.0441]
[null,"2002-08-10",1.0457000000000001]
[null,"2002-08-11",1.0472999999999999]
[null,"2002-08-12",1.0488999999999999]
[null,"2002-08-13",1.0505]
[null,"2002-08-14",1.0521]
[null,"2002-08-15",1.0537000000000001]
[null,"2002-08-16",1.0552999999999999]
[null,"2002-08-17",1.0569999999999999]
[null,"2002-08-18",1.0586]
[null,"2002-08-19",1.0602]
[null,"2002-08-20",1.0618000000000001]
[null,"2002-08-21",1.0634999999999999]
[null,"2002-08-22",1.0650999999999999]
[null,"2002-08-23",1.0667]
[null,"2002-08-24",1.0683]
[null,"2002-08-25",1.07]
[null,"2002-08-26",1.0716000000000001]
[null,"2002-08-27",1.0732999999999999]
[null,"2002-08-28",1.0749]
[null,"2002-08-29",1.0766]
[null,"2002-08-30",1.0782]
[null,"2002-08-31",1.0799000000000001]
[null,"2002-09-01",1.0820000000000001]
[null,"2002-09-02",1.0840000000000001]
[null,"2002-09-03",1.0861000000000001]
[null,"2002-09-04",1.0881000000000001]
[null,"2002-09-05",1.0902000000000001]
[null,"2002-09-06",1.0922000000000001]
[null,"2002-09-07",1.0943000000000001]
[null,"2002-09-08",1.0963000000000001]
[null,"2002-09-09",1.0984]
[null,"2002-09-10",1.1005]
[null,"2002-09-11",1.1026]
[null,"2002-09-12",1.1046]
[null,"2002-09-13",1.1067]
[null,"2002-09-14",1.1088]
[null,"2002-09-15",1.1109]
[null,"2002-09-16",1.1131]
[null,"2002-09-17",1.1151]
[null,"2002-09-18",1.1173]
[null,"2002-09-19",1.1193]
[null,"2002-09-20",1.1214999999999999]
[null,"2002-09-21",1.1234999999999999]
[null,"2002-09-22",1.1256999999999999]
[null,"2002-09-23",1.1277999999999999]
[null,"2002-09-24",1.1299999999999999]
[null,"2002-09-25",1.1321000000000001]
[null,"2002-09-26",1.1342000000000001]
[null,"2002-09-27",1.1364000000000001]
[null,"2002-09-28",1.1385000000000001]
[null,"2002-09-29",1.1407]
[null,"2002-09-30",1.1429]
[null,"2002-10-01",1.1439999999999999]
[null,"2002-10-02",1.1452]
[null,"2002-10-03",1.1463000000000001]
[null,"2002-10-04",1.1474]
[null,"2002-10-05",1.1486000000000001]
[null,"2002-10-06",1.1496999999999999]
[null,"2002-10-07",1.1509]
[null,"2002-10-08",1.1519999999999999]
[null,"2002-10-09",1.1531]
[null,"2002-10-10",1.1543000000000001]
[null,"2002-10-11",1.1554]
[null,"2002-10-12",1.1566000000000001]
[null,"2002-10-13",1.1577]
[null,"2002-10-14",1.1589]
[null,"2002-10-15",1.1599999999999999]
[null,"2002-10-16",1.1612]
[null,"2002-10-17",1.1623000000000001]
[null,"2002-10-18",1.1635]
[null,"2002-10-19",1.1646000000000001]
[null,"2002-10-20",1.1657999999999999]
[null,"2002-10-21",1.1669]
[null,"2002-10-22",1.1680999999999999]
[null,"2002-10-23",1.1693]
[null,"2002-10-24",1.1704000000000001]
[null,"2002-10-25",1.1716]
[null,"2002-10-26",1.1727000000000001]
[null,"2002-10-27",1.1738999999999999]
[null,"2002-10-28",1.1751]
[null,"2002-10-29",1.1761999999999999]
[null,"2002-10-30",1.1774]
[null,"2002-10-31",1.1786000000000001]
[null,"2002-11-01",1.179]
[null,"2002-11-02",1.1794]
[null,"2002-11-03",1.1797]
[null,"2002-11-04",1.1800999999999999]
[null,"2002-11-05",1.1805000000000001]
[null,"2002-11-06",1.1809000000000001]
[null,"2002-11-07",1.1813]
[null,"2002-11-08",1.1816]
[null,"2002-11-09",1.1819999999999999]
[null,"2002-11-10",1.1823999999999999]
[null,"2002-11-11",1.1828000000000001]
[null,"2002-11-12",1.1832]
[null,"2002-11-13",1.1835]
[null,"2002-11-14",1.1839]
[null,"2002-11-15",1.1842999999999999]
[null,"2002-11-16",1.1847000000000001]
[null,"2002-11-17",1.1851]
[null,"2002-11-18",1.1854]
[null,"2002-11-19",1.1858]
[null,"2002-11-20",1.1861999999999999]
[null,"2002-11-21",1.1866000000000001]
[null,"2002-11-22",1.1870000000000001]
[null,"2002-11-23",1.1874]
[null,"2002-11-24",1.1877]
[null,"2002-11-25",1.1880999999999999]
[null,"2002-11-26",1.1884999999999999]
[null,"2002-11-27",1.1889000000000001]
[null,"2002-11-28",1.1893]
[null,"2002-11-29",1.1896]
[null,"2002-11-30",1.19]
[null,"2002-12-01",1.1901999999999999]
[null,"2002-12-02",1.1902999999999999]
[null,"2002-12-03",1.1904999999999999]
[null,"2002-12-04",1.1907000000000001]
[null,"2002-12-05",1.1908000000000001]
[null,"2002-12-06",1.1910000000000001]
[null,"2002-12-07",1.1912]
[null,"2002-12-08",1.1913]
[null,"2002-12-09",1.1915]
[null,"2002-12-10",1.1916]
[null,"2002-12-11",1.1918]
[null,"2002-12-12",1.1919999999999999]
[null,"2002-12-13",1.1920999999999999]
[null,"2002-12-14",1.1922999999999999]
[null,"2002-12-15",1.1924999999999999]
[null,"2002-12-16",1.1926000000000001]
[null,"2002-12-17",1.1928000000000001]
[null,"2002-12-18",1.1930000000000001]
[null,"2002-12-19",1.1931]
[null,"2002-12-20",1.1933]
[null,"2002-12-21",1.1935]
[null,"2002-12-22",1.1936]
[null,"2002-12-23",1.1938]
[null,"2002-12-24",1.194]
[null,"2002-12-25",1.1940999999999999]
[null,"2002-12-26",1.1942999999999999]
[null,"2002-12-27",1.1944999999999999]
[null,"2002-12-28",1.1946000000000001]
[null,"2002-12-29",1.1948000000000001]
[null,"2002-12-30",1.1950000000000001]
[null,"2002-12-31",1.1951000000000001]
[null,"2003-01-01",1.1956]
[null,"2003-01-02",1.1960999999999999]
[null,"2003-01-03",1.1964999999999999]
[null,"2003-01-04",1.1970000000000001]
[null,"2003-01-05",1.1975]
[null,"2003-01-06",1.198]
[null,"2003-01-07",1.1984999999999999]
[null,"2003-01-08",1.1990000000000001]
[null,"2003-01-09",1.1995]
[null,"2003-01-10",1.1999]
[null,"2003-01-11",1.2003999999999999]
[null,"2003-01-12",1.2009000000000001]
[null,"2003-01-13",1.2014]
[null,"2003-01-14",1.2019]
[null,"2003-01-15",1.2023999999999999]
[null,"2003-01-16",1.2028000000000001]
[null,"2003-01-17",1.2033]
[null,"2003-01-18",1.2038]
[null,"2003-01-19",1.2042999999999999]
[null,"2003-01-20",1.2048000000000001]
[null,"2003-01-21",1.2053]
[null,"2003-01-22",1.2058]
[null,"2003-01-23",1.2062999999999999]
[null,"2003-01-24",1.2067000000000001]
[null,"2003-01-25",1.2072000000000001]
[null,"2003-01-26",1.2077]
[null,"2003-01-27",1.2081999999999999]
[null,"2003-01-28",1.2087000000000001]
[null,"2003-01-29",1.2092000000000001]
[null,"2003-01-30",1.2097]
[null,"2003-01-31",1.2101999999999999]
[null,"2003-02-01",1.2110000000000001]
[null,"2003-02-02",1.2118]
[null,"2003-02-03",1.2125999999999999]
[null,"2003-02-04",1.2134]
[null,"2003-02-05",1.2141999999999999]
[null,"2003-02-06",1.2150000000000001]
[null,"2003-02-07",1.2158]
[null,"2003-02-08",1.2165999999999999]
[null,"2003-02-09",1.2174]
[null,"2003-02-10",1.2181999999999999]
[null,"2003-02-11",1.2190000000000001]
[null,"2003-02-12",1.2198]
[null,"2003-02-13",1.2206999999999999]
[null,"2003-02-14",1.2215]
[null,"2003-02-15",1.2222999999999999]
[null,"2003-02-16",1.2231000000000001]
[null,"2003-02-17",1.2239]
[null,"2003-02-18",1.2246999999999999]
[null,"2003-02-19",1.2255]
[null,"2003-02-20",1.2262999999999999]
[null,"2003-02-21",1.2271000000000001]
[null,"2003-02-22",1.2279]
[null,"2003-02-23",1.2287999999999999]
[null,"2003-02-24",1.2296]
[null,"2003-02-25",1.2303999999999999]
[null,"2003-02-26",1.2312000000000001]
[null,"2003-02-27",1.232]
[null,"2003-02-28",1.2327999999999999]
[null,"2003-03-01",1.2333000000000001]
[null,"2003-03-02",1.2339]
[null,"2003-03-03",1.2343999999999999]
[null,"2003-03-04",1.2350000000000001]
[null,"2003-03-05",1.2355]
[null,"2003-03-06",1.236]
[null,"2003-03-07",1.2365999999999999]
[null,"2003-03-08",1.2371000000000001]
[null,"2003-03-09",1.2376]
[null,"2003-03-10",1.2382]
[null,"2003-03-11",1.2386999999999999]
[null,"2003-03-12",1.2393000000000001]
[null,"2003-03-13",1.2398]
[null,"2003-03-14",1.2403]
[null,"2003-03-15",1.2408999999999999]
[null,"2003-03-16",1.2414000000000001]
[null,"2003-03-17",1.242]
[null,"2003-03-18",1.2424999999999999]
[null,"2003-03-19",1.2430000000000001]
[null,"2003-03-20",1.2436]
[null,"2003-03-21",1.2441]
[null,"2003-03-22",1.2446999999999999]
[null,"2003-03-23",1.2452000000000001]
[null,"2003-03-24",1.2458]
[null,"2003-03-25",1.2463]
[null,"2003-03-26",1.2467999999999999]
[null,"2003-03-27",1.2474000000000001]
[null,"2003-03-28",1.2479]
[null,"2003-03-29",1.2484999999999999]
[null,"2003-03-30",1.2490000000000001]
[null,"2003-03-31",1.2496]
[null,"2003-04-01",1.2501]
[null,"2003-04-02",1.2505999999999999]
[null,"2003-04-03",1.2511000000000001]
[null,"2003-04-04",1.2517]
[null,"2003-04-05",1.2522]
[null,"2003-04-06",1.2526999999999999]
[null,"2003-04-07",1.2532000000000001]
[null,"2003-04-08",1.2537]
[null,"2003-04-09",1.2542]
[null,"2003-04-10",1.2546999999999999]
[null,"2003-04-11",1.2553000000000001]
[null,"2003-04-12",1.2558]
[null,"2003-04-13",1.2563]
[null,"2003-04-14",1.2567999999999999]
[null,"2003-04-15",1.2573000000000001]
[null,"2003-04-16",1.2578]
[null,"2003-04-17",1.2584]
[null,"2003-04-18",1.2588999999999999]
[null,"2003-04-19",1.2594000000000001]
[null,"2003-04-20",1.2599]
[null,"2003-04-21",1.2604]
[null,"2003-04-22",1.2608999999999999]
[null,"2003-04-23",1.2615000000000001]
[null,"2003-04-24",1.262]
[null,"2003-04-25",1.2625]
[null,"2003-04-26",1.2629999999999999]
[null,"2003-04-27",1.2635000000000001]
[null,"2003-04-28",1.2641]
[null,"2003-04-29",1.2645999999999999]
[null,"2003-04-30",1.2650999999999999]
[null,"2003-05-01",1.2655000000000001]
[null,"2003-05-02",1.2659]
[null,"2003-05-03",1.2663]
[null,"2003-05-04",1.2665999999999999]
[null,"2003-05-05",1.2669999999999999]
[null,"2003-05-06",1.2674000000000001]
[null,"2003-05-07",1.2678]
[null,"2003-05-08",1.2682]
[null,"2003-05-09",1.2685999999999999]
[null,"2003-05-10",1.2689999999999999]
[null,"2003-05-11",1.2694000000000001]
[null,"2003-05-12",1.2697000000000001]
[null,"2003-05-13",1.2701]
[null,"2003-05-14",1.2705]
[null,"2003-05-15",1.2708999999999999]
[null,"2003-05-16",1.2713000000000001]
[null,"2003-05-17",1.2717000000000001]
[null,"2003-05-18",1.2721]
[null,"2003-05-19",1.2725]
[null,"2003-05-20",1.2727999999999999]
[null,"2003-05-21",1.2732000000000001]
[null,"2003-05-22",1.2736000000000001]
[null,"2003-05-23",1.274]
[null,"2003-05-24",1.2744]
[null,"2003-05-25",1.2747999999999999]
[null,"2003-05-26",1.2751999999999999]
[null,"2003-05-27",1.2756000000000001]
[null,"2003-05-28",1.276]
[null,"2003-05-29",1.2763]
[null,"2003-05-30",1.2766999999999999]
[null,"2003-05-31",1.2770999999999999]
[null,"2003-06-01",1.2773000000000001]
[null,"2003-06-02",1.2774000000000001]
[null,"2003-06-03",1.2776000000000001]
[null,"2003-06-04",1.2777000000000001]
[null,"2003-06-05",1.2779]
[null,"2003-06-06",1.278]
[null,"2003-06-07",1.2782]
[null,"2003-06-08",1.2784]
[null,"2003-06-09",1.2785]
[null,"2003-06-10",1.2786999999999999]
[null,"2003-06-11",1.2787999999999999]
[null,"2003-06-12",1.2789999999999999]
[null,"2003-06-13",1.2790999999999999]
[null,"2003-06-14",1.2793000000000001]
[null,"2003-06-15",1.2795000000000001]
[null,"2003-06-16",1.2796000000000001]
[null,"2003-06-17",1.2798]
[null,"2003-06-18",1.2799]
[null,"2003-06-19",1.2801]
[null,"2003-06-20",1.2802]
[null,"2003-06-21",1.2804]
[null,"2003-06-22",1.2806]
[null,"2003-06-23",1.2806999999999999]
[null,"2003-06-24",1.2808999999999999]
[null,"2003-06-25",1.2809999999999999]
[null,"2003-06-26",1.2811999999999999]
[null,"2003-06-27",1.2814000000000001]
[null,"2003-06-28",1.2815000000000001]
[null,"2003-06-29",1.2817000000000001]
[null,"2003-06-30",1.2818000000000001]
[null,"2003-07-01",1.2819]
[null,"2003-07-02",1.2819]
{"$rows_left_out":6367}
{"sheet":"Parametros","index":1,"n_rows":48,"n_cols":7,"rows_kept":48,"cut":false,"hidden":true,"merged":[[18,3,18,5],[24,3,24,5]]}
[null,null,"PARAMETROS PARA EL CALCULO",null,"Multa por Contraversion:",12080]
[null,null,null,null,"Ley:",18930]
[]
[null,null,"DIMENSIONES"]
[null,null,"RELACION","DIMENSIONES","ACTIVOS","INGRESOS"]
[null,null,"<=","PEQUEÑA/MEDIANA",7500000,24000000]
[null,null,">=","GRAN",7500000,24000000]
[]
[null,null,"MULTAS EMPRESAS Ley 18.930"]
[null,null,"DIMENSION","DESCRIPCION PLAZO","MULTA"]
[null,null,"PEQUEÑA/MEDIANA","MENOR A SEIS MESES",5]
[null,null,"PEQUEÑA/MEDIANA","ENTRE SEIS MESES Y DOS AÑOS",10]
[null,null,"PEQUEÑA/MEDIANA","DOS AÑOS Y MÁS",40]
[null,null,"GRAN","MENOR A SEIS MESES",10]
[null,null,"GRAN","ENTRE SEIS MESES Y DOS AÑOS",20]
[null,null,"GRAN","DOS AÑOS Y MÁS",100]
[]
[null,null,"MULTAS TITULARES (max. MC) LEY 18.930"]
[null,null,"PEQUEÑA/MEDIANA DIMENSION","Plazo de incumplimiento "]
[null,null,"PARTICIPACION","MENOR A SEIS MESES","ENTRE SEIS MESES Y DOS AÑOS","DOS AÑOS Y MÁS"]
[null,null,"MENOR AL 10%",2,3,10]
[null,null,"ENTRE 10% Y 50%",3,5,15]
[null,null,"MAYOR AL 50%",5,10,40]
[]
[null,null,"GRAN DIMENSION","Plazo de incumplimiento "]
[null,null,"PARTICIPACION","MENOR A SEIS MESES","ENTRE SEIS MESES Y DOS AÑOS","DOS AÑOS Y MÁS"]
[null,null,"MENOR AL 10%",3,5,15]
[null,null,"ENTRE 10% Y 50%",5,10,25]
[null,null,"MAYOR AL 50%",10,20,100]
[]
[null,null,"Seleccione participación del Titular"]
[null,null,"MENOR AL 10%"]
[null,null,"ENTRE 10% Y 50%"]
[null,null,"MAYOR AL 50%"]
[]
[null,null,"SOCIEDAD/PLAZO VENCIMIENTO PRIMER COMUNICACION LEY 18.930"]
[null,null,"Tipos Societarios","Fecha Vencimiento Plazo 1era comunicaciòn","Meses incumplimiento","Descripción","Columna1"]
[null,null,"Entidades Residentes Emisoras de Participaciones Patrimoniales al Portador","2013-05-31",{"$f":"(YEAR(Simulador!E11)-YEAR(Parametros!D38))*12+MONTH(Simulador!E11)-MONTH(Parametros!D38)","v":-1360},{"$f":"IF(AND(G38<6,G38>0),\"MENOR A SEIS MESES\", IF(G38>=24,\"DOS AÑOS Y MÁS\",IF(AND(G38>=6,G38<24),\"ENTRE SEIS MESES Y DOS AÑOS\",\"NO HAY INCUMPLIMIENTO\")))","v":"NO HAY INCUMPLIMIENTO"},{"$f":"IF(E38=6,IF(DAY(Simulador!E11)>=DAY(D38),6,5),IF(E38=24,IF(DAY(Simulador!E11)>=DAY(D38),24,23),E38))","v":-1360}]
[null,null,"No Residentes con Participaciones al Portador","2013-05-31",{"$f":"(YEAR(Simulador!E11)-YEAR(Parametros!D39))*12+MONTH(Simulador!E11)-MONTH(Parametros!D39)","v":-1360},{"$f":"IF(AND(G39<6,G39>0),\"MENOR A SEIS MESES\", IF(G39>24,\"DOS AÑOS Y MÁS\",IF(AND(G39>=6,G39<24),\"ENTRE SEIS MESES Y DOS AÑOS\",\"NO HAY INCUMPLIMIENTO\")))","v":"NO HAY INCUMPLIMIENTO"},{"$f":"IF(E39=6,IF(DAY(Simulador!E12)>=DAY(D39),6,5),IF(E39=24,IF(DAY(Simulador!E12)>=DAY(D39),24,23),E39))","v":-1360}]
[null,null,"No Residentes con Participaciones NO al Portador","2014-12-31",{"$f":"(YEAR(Simulador!E11)-YEAR(Parametros!D40))*12+MONTH(Simulador!E11)-MONTH(Parametros!D40)","v":-1379},{"$f":"IF(AND(G40<6,G40>0),\"MENOR A SEIS MESES\", IF(G40>24,\"DOS AÑOS Y MÁS\",IF(AND(G40>=6,G40<24),\"ENTRE SEIS MESES Y DOS AÑOS\",\"NO HAY INCUMPLIMIENTO\")))","v":"NO HAY INCUMPLIMIENTO"},{"$f":"IF(E40=6,IF(DAY(Simulador!E13)>=DAY(D40),6,5),IF(E40=24,IF(DAY(Simulador!E13)>=DAY(D40),24,23),E40))","v":-1379}]
[null,null,null,null,{"$f":"(YEAR(Simulador!E11)-YEAR(Parametros!D41))*12+MONTH(Simulador!E11)-MONTH(Parametros!D41)","v":0},{"$f":"IF(AND(E41<=6,E41>0),\"MENOR A SEIS MESES\", IF(E41>24,\"DOS AÑOS Y MÁS\",IF(AND(E41>6,E41<=24),\"ENTRE SEIS MESES Y DOS AÑOS\",\"NO HAY INCUMPLIMIENTO\")))","v":"NO HAY INCUMPLIMIENTO"},{"$f":"IF(E41=6,IF(DAY(Simulador!E14)>=DAY(D41),6,5),IF(E41=24,IF(DAY(Simulador!E14)>=DAY(D41),24,23),E41))","v":0}]
[]
[null,null,"SOCIEDAD/PLAZO VENCIMIENTO MODIFICACION LEY 18.930"]
[null,null,"Columna1","Fecha Vencimiento Plazo Modificación","Meses incumplimiento","Descripción"]
[null,null,null,{"$f":"Simulador!E15","v":"00:00:00"},{"$f":"(YEAR(Simulador!E11)-YEAR(Parametros!D45))*12+MONTH(Simulador!E11)-MONTH(Parametros!D45)","v":0},{"$f":"IF(AND(E48<6,E48>0),\"MENOR A SEIS MESES\", IF(E48>=24,\"DOS AÑOS Y MÁS\",IF(AND(E48>=6,E48<24),\"ENTRE SEIS MESES Y DOS AÑOS\",\"NO HAY INCUMPLIMIENTO\")))","v":"NO HAY INCUMPLIMIENTO"}]
[]
[]
[null,null,null,null,{"$f":"IF(E45=6,IF(DAY(Simulador!E11)>=DAY(D45),6,5),IF(E45=24,IF(DAY(Simulador!E11)>=DAY(D45),24,23),E45))","v":0}]

{"sheet":"Simulador","index":2,"n_rows":26,"n_cols":8,"rows_kept":26,"cut":false,"hidden":false,"merged":[[17,5,17,7],[25,3,25,4],[14,5,15,7]]}
[null,null,null,null,"Simulador de multas por incumplimiento Ley 18.930",null,null,{"$f":"TODAY()","v":"2024-01-26"}]
[null,null,null,null,"Titular"]
[null,null,"Identificación"]
[null,null,"Rut:"]
[null,null,"Denominación:"]
[null,null,"Tipo de Entidad:"]
[]
[null,null,"Datos Requeridos para el cálculo"]
[]
[null,null,"Empresa"]
[null,null,null,"Fecha de envío de la comunicación al BCU",null,null,"VALOR UI",1]
[null,null,null,"Fecha último Balance","2022-12-31"]
[null,null,null,"Activos en UI correspondientes al ultimo ingreso"]
[null,null,null,"Ingresos Anuales en UI correspondientes al ultimo ingreso"]
[null,null,null,"Fecha vencimiento plazo"]
[]
[null,null,null,"Dimensión",{"$f":"IF(ISNUMBER(H11),IF(AND(E13<=Parametros!E6,E14<=Parametros!F6),Parametros!D6,Parametros!D7),\"\")","v":"PEQUEÑA/MEDIANA"}]
[null,null,null,"Plazo",{"$f":"IF(AND(E6<>\"\",E15=\"\"),INDEX(Parametros!F38:F40, MATCH(E6, Parametros!C38:C40,0)),Parametros!F45)","v":"NO HAY INCUMPLIMIENTO"}]
[]
[null,null,"Multas para Titular"]
[null,null,null,"Participación","ENTRE 10% Y 50%"]
[]
[null,null,null,"Cantidad Veces MC",{"$f":"IF(E18=\"NO HAY INCUMPLIMIENTO\",0,IF(E21<>\"Seleccione participación del Titular\",IF(E17=\"PEQUEÑA/MEDIANA\",(INDEX(Parametros!C20:F23,MATCH(E21,Parametros!C20:C23,0),MATCH(E18,Parametros!C20:F20,0))),(INDEX(Parametros!C26:F29,MATCH(E21,Parametros!C26:C29,0),MATCH(E18,Parametros!C26:F26,0)))),\"\"))","v":0}]
[null,null,null,"Multa",{"$f":"IF(ISNUMBER(E23),E23*Parametros!F1,\"\")","v":0}]
[]
[null,null,null,"ACLARACIÓN: El presente simulador es una herramienta informática creada por A.I.N. con el objetivo de guiar y facilitar al Usuario en el cálculo de las multas por incumplimientos a las obligaciones contempladas por las Leyes Nro. 18.930 del 17 de julio del 2012 y Nro. 19.484 del 5 de enero de 2017. El resultado obtenido en este simulador es en base a los valores ingresados por el Usuario y no constituye una opinión o dictamen de A.I.N. Es deber del Usuario revisar que el resultado obtenido sea el correcto según su caso."]